Test1: uclibc 0.9.28.1

In the building process the following messages appear

Target Architecture
> 12. mips (TARGET_mips)

Target Processor Architecture
> 1. Generic (MIPS I) (CONFIG_MIPS_ISA_1)

Target Processor Endianness
> 1. Little Endian (ARCH_LITTLE_ENDIAN)

Then, I choose the following options:

Target CPU has a floating point unit (FPU) (HAS_FPU) [Y/n/?] (NEW)
n

After 1hs 10 min: ERRORS!!

/mnt/tesis/tesis/pruebas/andy/buildroot/build_mipsel_nofpu/staging_dir/bin/mipsel-linux-uclibc-gcc  -Wall -Wstrict-prototypes -Wno-trigraphs -fno-strict-aliasing  -mips1 -msoft-float  -fno-builtin -nostdinc -D_LIBC -I../../../../include -I.  -Os -funit-at-a-time  -mno-split-addresses -isystem /mnt/tesis/tesis/pruebas/andy/buildroot/build_mipsel_nofpu/staging_dir/lib/gcc/mipsel-linux-uclibc/3.4.6/include -DNDEBUG -fPIC -c read.c -o read.o
/mnt/tesis/tesis/pruebas/andy/buildroot/build_mipsel_nofpu/staging_dir/bin/mipsel-linux-uclibc-strip -x -R .note -R .comment read.o
/mnt/tesis/tesis/pruebas/andy/buildroot/build_mipsel_nofpu/staging_dir/bin/mipsel-linux-uclibc-gcc  -Wall -Wstrict-prototypes -Wno-trigraphs -fno-strict-aliasing  -mips1 -msoft-float  -fno-builtin -nostdinc -D_LIBC -I../../../../include -I.  -Os -funit-at-a-time  -mno-split-addresses -isystem /mnt/tesis/tesis/pruebas/andy/buildroot/build_mipsel_nofpu/staging_dir/lib/gcc/mipsel-linux-uclibc/3.4.6/include -DNDEBUG -fPIC -c readahead.c -o readahead.o
readahead.c:45: error: syntax error before "off64_t"
readahead.c:46: warning: function declaration isn't a prototype
readahead.c: In function `readahead':
readahead.c:47: error: `fd' undeclared (first use in this function)
readahead.c:47: error: (Each undeclared identifier is reported only once
readahead.c:47: error: for each function it appears in.)
readahead.c:47: error: `offset' undeclared (first use in this function)
readahead.c:47: error: `count' undeclared (first use in this function)
make[5]: *** [readahead.o] Error 1
make[5]: Leaving directory `/mnt/tesis/tesis/pruebas/andy/buildroot/toolchain_build_mipsel_nofpu/uClibc-0.9.28.1/libc/sysdeps/linux/common'
make[4]: *** [common] Error 2
make[4]: Leaving directory `/mnt/tesis/tesis/pruebas/andy/buildroot/toolchain_build_mipsel_nofpu/uClibc-0.9.28.1/libc/sysdeps/linux'
make[3]: *** [_dir_linux] Error 2
make[3]: Leaving directory `/mnt/tesis/tesis/pruebas/andy/buildroot/toolchain_build_mipsel_nofpu/uClibc-0.9.28.1/libc/sysdeps'
make[2]: *** [_dir_sysdeps] Error 2
make[2]: Leaving directory `/mnt/tesis/tesis/pruebas/andy/buildroot/toolchain_build_mipsel_nofpu/uClibc-0.9.28.1/libc'
make[1]: *** [_dir_libc] Error 2
make[1]: se sale del directorio `/mnt/tesis/tesis/pruebas/andy/buildroot/toolchain_build_mipsel_nofpu/uClibc-0.9.28.1'
make: *** [/mnt/tesis/tesis/pruebas/andy/buildroot/toolchain_build_mipsel_nofpu/uClibc-0.9.28.1/lib/libc.a] Error 2
Unless otherwise stated, the content of this page is licensed under Creative Commons Attribution-ShareAlike 3.0 License